Target
5-hydroxytryptamine receptor 1A
Ligand
BDBM31031
Substrate
Not Available
Meas. Tech.
Dose Response Assay for Agonists of 5-Hydroxytryptamine (Serotonin) Receptor Subtype 1A (5HT1A)
pH
7.4±n/a
Temperature
296.15±n/a K
EC50
50000±n/a nM
Citation
 PubChem, PC Dose Response assay for agonists of 5-Hydroxytryptamine (Serotonin) Receptor Subtype 1A (5HT1A) PubChem Bioassay (2007)[AID] 
Target
Name:
5-hydroxytryptamine receptor 1A
Synonyms:
5-HT-1A 5-hydroxytryptamine receptor 1A (5-HT-1A) ADRB2RL1 Dopamine D2 receptor and serotonin 1a receptor HTR1A | Serotonin receptor 1A
Type:
Mol. Mass.:
46122.49
Organism:
Homo sapiens (Human)
Description:
Residue:
422
  
Inhibitor
Name:
BDBM31031
Synonyms:
1-[[2-(2-furoylamino)-4,5-dimethyl-3-thienyl]-(3-pyridyl)methyl]isonipecotic acid ethyl ester MLS000085109 cid_3245442 ethyl 1-[[2-(furan-2-carbonylamino)-4,5-dimethylthiophen-3-yl]-pyridin-3-ylmethyl]piperidine-4-carboxylate | ethyl 1-[[2-(furan-2-ylcarbonylamino)-4,5-dimethyl-thiophen-3-yl]-pyridin-3-yl-methyl]piperidine-4-carboxylate
Type:
Small organic molecule
Emp. Form.:
C25H29N3O4S
Mol. Mass.:
467.58
SMILES:
CCOC(=O)C1CCN(CC1)C(c1c(C)c(C)sc1NC(=O)c1ccco1)c1cccnc1
:
Substrate
Name:
Not Available
Synonyms:
Type:
Mol. Mass.:
358.43
Organism:
Description:
Residue:
3
NA