Target
5-hydroxytryptamine receptor 1A
Ligand
BDBM31035
Substrate
Not Available
Meas. Tech.
Dose Response Assay for Agonists of 5-Hydroxytryptamine (Serotonin) Receptor Subtype 1A (5HT1A)
pH
7.4±n/a
Temperature
296.15±n/a K
EC50
50000±n/a nM
Citation
 PubChem, PC Dose Response assay for agonists of 5-Hydroxytryptamine (Serotonin) Receptor Subtype 1A (5HT1A) PubChem Bioassay (2007)[AID] 
Target
Name:
5-hydroxytryptamine receptor 1A
Synonyms:
5-HT-1A 5-hydroxytryptamine receptor 1A (5-HT-1A) ADRB2RL1 Dopamine D2 receptor and serotonin 1a receptor HTR1A | Serotonin receptor 1A
Type:
Mol. Mass.:
46122.49
Organism:
Homo sapiens (Human)
Description:
Residue:
422
  
Inhibitor
Name:
BDBM31035
Synonyms:
4-[4-(2-anilino-2-keto-ethoxy)-3-methoxy-phenyl]-2-keto-6-methyl-3,4-dihydro-1H-pyrimidine-5-carboxylic acid ethyl ester MLS000116045 cid_3154442 ethyl 4-[4-(2-anilino-2-oxoethoxy)-3-methoxyphenyl]-6-methyl-2-oxo-3,4-dihydro-1H-pyrimidine-5-carboxylate
Type:
Small organic molecule
Emp. Form.:
C23H25N3O6
Mol. Mass.:
439.4611
SMILES:
CCOC(=O)C1C(NC(=O)N=C1C)c1ccc(OCC(=O)Nc2ccccc2)c(OC)c1
:
Substrate
Name:
Not Available
Synonyms:
Type:
Mol. Mass.:
358.43
Organism:
Description:
Residue:
3
NA