Target
5-hydroxytryptamine receptor 1A
Ligand
BDBM31037
Substrate
Not Available
Meas. Tech.
Dose Response Assay for Agonists of 5-Hydroxytryptamine (Serotonin) Receptor Subtype 1A (5HT1A)
pH
7.4±n/a
Temperature
296.15±n/a K
EC50
50000±n/a nM
Citation
 PubChem, PC Dose Response assay for agonists of 5-Hydroxytryptamine (Serotonin) Receptor Subtype 1A (5HT1A) PubChem Bioassay (2007)[AID] 
Target
Name:
5-hydroxytryptamine receptor 1A
Synonyms:
5-HT-1A 5-hydroxytryptamine receptor 1A (5-HT-1A) ADRB2RL1 Dopamine D2 receptor and serotonin 1a receptor HTR1A | Serotonin receptor 1A
Type:
Mol. Mass.:
46122.49
Organism:
Homo sapiens (Human)
Description:
Residue:
422
  
Inhibitor
Name:
BDBM31037
Synonyms:
1-(2,4-dimethoxybenzyl)-4-(2-fluorophenyl)piperazine MLS000105278 cid_2173523
Type:
Small organic molecule
Emp. Form.:
C19H23FN2O2
Mol. Mass.:
330.3965
SMILES:
COc1ccc(CN2CCN(CC2)c2ccccc2F)c(OC)c1
:
Substrate
Name:
Not Available
Synonyms:
Type:
Mol. Mass.:
358.43
Organism:
Description:
Residue:
3
NA