Target
Polyunsaturated fatty acid 5-lipoxygenase
Ligand
BDBM31138
Substrate
BDBM22319
Meas. Tech.
Inhibition of 5-LO Product Formation in Cell-Free Systems (IC50) and in Intact Neutrophils (EC50/IC50)
IC50
130±n/a nM
EC50
350±n/a nM
Citation
 Karg, EMLuderer, SPergola, CBühring, URossi, ANorthoff, HSautebin, LTroschütz, RWerz, O Structural optimization and biological evaluation of 2-substituted 5-hydroxyindole-3-carboxylates as potent inhibitors of human 5-lipoxygenase. J Med Chem 52:3474-83 (2009)  
Target
Name:
Polyunsaturated fatty acid 5-lipoxygenase
Synonyms:
5-LO 5-Lipoxygenase (5-LO) 5-Lipoygenase ALOX5 LOG5 | LOX5_HUMAN
Type:
Enzyme
Mol. Mass.:
77972.74
Organism:
Homo sapiens (Human)
Description:
Recombinant protein was purified from E. coli lysate. After ammonium sulfate precipitation and subsequent steps, the supernatant (S100) was used for 5-LO activity assay.
Residue:
674
  
Inhibitor
Name:
BDBM31138
Synonyms:
5-hydroxy-1H-benzo[g]indole-3-carboxylate, 11q
Type:
Small organic molecule
Emp. Form.:
C27H20ClNO3
Mol. Mass.:
441.906
SMILES:
Oc1cc2c(C(=O)OCc3ccccc3)c(Cc3cccc(Cl)c3)[nH]c2c2ccccc12
:
Substrate
Name:
BDBM22319
Synonyms:
(5Z,8Z,11Z,14Z)-icosa-5,8,11,14-tetraenoic acid Arachidonic acid (AA) [1-14C]Arachidonic acid
Type:
Unsaturated fatty acid
Emp. Form.:
C20H32O2
Mol. Mass.:
304.4669
SMILES:
CCCCC\C=C/C\C=C/C\C=C/C\C=C/CCCC(O)=O
: