Target
Bcl-2-like protein 1
Ligand
BDBM31417
Substrate
Fl-Bak peptide
Meas. Tech.
Fluorescence Polarization Assay
pH
7.4±n/a
Temperature
298.15±n/a K
Ki
18200±n/a nM
Citation
 Yin, HLee, GISedey, KAKutzki, OPark, HSOrner, BPErnst, JTWang, HGSebti, SMHamilton, AD Terphenyl-Based Bak BH3 alpha-helical proteomimetics as low-molecular-weight antagonists of Bcl-xL. J Am Chem Soc 127:10191-6 (2005)  
Target
Name:
Bcl-2-like protein 1
Synonyms:
Anti-apoptotic Bcl-2 protein Apoptosis regulator Bcl-X BCL2-like 1 isoform 1 BCL2L1 Bcl-2-like protein 1 (Bcl-XL) Bcl-xL/Bcl-2-binding component 3 Bcl2-antagonist of cell death (BAD)
Type:
Mitochondrion membrane; Single-pass membrane protein
Mol. Mass.:
26039.60
Organism:
Homo sapiens (Human)
Description:
Residue:
233
  
Inhibitor
Name:
BDBM31417
Synonyms:
terphenyl scaffold, 25
Type:
Small organic molecule
Emp. Form.:
C23H22O3
Mol. Mass.:
346.419
SMILES:
Cc1cccc(c1)-c1ccc(cc1C)-c1ccc(OCC(O)=O)cc1C
:
Substrate
Name:
Fl-Bak peptide
Synonyms:
Type:
Fluoroscein-labled peptide
Mol. Mass.:
2079.80
Organism:
Description:
The N-terminus of fluoroscein-labled Bak peptide was capped with the fluorophore and the C-terminus was amidated.
Residue:
19
GQVGRQLAIIGDDINRCNH