Target
Substance-K receptor
Ligand
BDBM242749
Substrate
Meas. Tech.
Inhibition Assay
Ki
>30000±n/a nM
Citation
 Hoveyda, HDutheuil, GFraser, G N-acyl-(3-substituted)-(8-substituted)-5,6-dihydro-[1,2,4]triazolo[4,3-a]pyrazines as selective NK-3 receptor antagonists US Patent  US9987274 Publication Date 6/5/2018 
Target
Name:
Substance-K receptor
Synonyms:
NK-2 receptor NK2R NKNAR Neurokinin A receptor Neurokinin-2 (NK-2) SKR TACR2 Tachykinin receptor 2 (NK2) | hnk-3
Type:
Protein
Mol. Mass.:
44455.78
Organism:
Homo sapiens (Human)
Description:
P21452
Residue:
398
  
Inhibitor
Name:
BDBM242749
Synonyms:
US10030025, Compound 13 US11731974, Compound 13 US9987274, Compound 13
Type:
Small organic molecule
Emp. Form.:
C17H17FN6O2
Mol. Mass.:
356.3543
SMILES:
CCc1noc(n1)-c1nnc2[C@@H](C)N(CCn12)C(=O)c1ccc(F)cc1
: