Target
3-hydroxyacyl-[acyl-carrier-protein] dehydratase FabZ
Ligand
BDBM31961
Substrate
BDBM8737
Meas. Tech.
Enzymatic Inhibition Assay
IC50
12800±n/a nM
Citation
 He, LZhang, LLiu, XLi, XZheng, MLi, HYu, KChen, KShen, XJiang, HLiu, H Discovering potent inhibitors against the beta-hydroxyacyl-acyl carrier protein dehydratase (FabZ) of Helicobacter pylori: structure-based design, synthesis, bioassay, and crystal structure determination. J Med Chem 52:2465-81 (2009)  
Target
Name:
3-hydroxyacyl-[acyl-carrier-protein] dehydratase FabZ
Synonyms:
(3R)-hydroxymyristoyl ACP dehydrase FABZ_HELPY fabZ
Type:
Lyase
Mol. Mass.:
18198.05
Organism:
Helicobacter pylori (Campylobacter pylori)
Description:
HpfabZ is expressed and purified from E. coli.
Residue:
159
  
Inhibitor
Name:
BDBM31961
Synonyms:
carbohydrazide derivative, 5d
Type:
Small organic molecule
Emp. Form.:
C20H14Br2N2O4
Mol. Mass.:
506.144
SMILES:
Oc1c(Br)cc(C=NNC(=O)c2ccc(Oc3ccccc3)cc2)c(O)c1Br
:
Substrate
Name:
BDBM8737
Synonyms:
2-Butenoyl-CoA Crotonoyl-CoA {[(2R,3S,4R,5R)-5-(6-amino-9H-purin-9-yl)-2-{[({[(3-{[2-({2-[(2E)-but-2-enoylsulfanyl]ethyl}carbamoyl)ethyl]carbamoyl}-3-hydroxy-2,2-dimethylpropoxy)(hydroxy)phosphoryl]oxy}(hydroxy)phosphoryl)oxy]methyl}-4-hydroxyoxolan-3-yl]oxy}phosphonic acid
Type:
Small organic molecule
Emp. Form.:
C25H40N7O17P3S
Mol. Mass.:
835.608
SMILES:
C\C=C\C(=O)SCCNC(=O)CCNC(=O)C(O)C(C)(C)COP(O)(=O)OP(O)(=O)OC[C@H]1O[C@H]([C@H](O)[C@@H]1OP(O)(O)=O)n1cnc2c(N)ncnc12
: