Target
Procathepsin L [114-333,T223A]
Ligand
BDBM31992
Substrate
BDBM22047
Meas. Tech.
Cathepsin Inhibition Assay
pH
7±n/a
Temperature
310.15±n/a K
IC50
13±n/a nM
Citation
 Asaad, NBethel, PACoulson, MDDawson, JEFord, SJGerhardt, SGrist, MHamlin, GAJames, MJJones, EVKaroutchi, GIKenny, PWMorley, ADOldham, KRankine, NRyan, DWells, SLWood, LAugustin, MKrapp, SSimader, HSteinbacher, S Dipeptidyl nitrile inhibitors of Cathepsin L. Bioorg Med Chem Lett 19:4280-3 (2009)  
Target
Name:
Procathepsin L [114-333,T223A]
Synonyms:
CATL1_HUMAN CTSL1 | Cathepsin L
Type:
Cysteine Protease
Mol. Mass.:
24128.88
Organism:
Homo sapiens (Human)
Description:
P07711[114-333,T223A]
Residue:
220
  
Inhibitor
Name:
BDBM31992
Synonyms:
Dipeptidyl nitrile inhibitor, 25
Type:
Small organic molecule
Emp. Form.:
C20H24ClN5O2
Mol. Mass.:
401.89
SMILES:
Cn1nc(cc1C(=O)N[C@@H](Cc1cccc(Cl)c1)C(=O)NCC#N)C(C)(C)C
:
Substrate
Name:
BDBM22047
Synonyms:
CBZ-Phe-Arg 7-amido-4-methylcoumarin | Z-Phe-Arg-AMC
Type:
Fluorogenic substrate
Emp. Form.:
C33H36N6O6
Mol. Mass.:
612.6755
SMILES:
[#6]-c1cc(=O)oc2cc(-[#7]-[#6](=O)-[#6](-[#6]-[#6]-[#6]\[#7]=[#6](\[#7])-[#7])-[#7]-[#6](=O)-[#6](-[#6]-c3ccccc3)-[#7]-[#6](=O)-[#8]-[#6]-c3ccccc3)ccc12
: