Target
Serine/threonine-protein kinase D1
Ligand
BDBM16173
Substrate
Substrate Peptide
Meas. Tech.
Fluorescence polarization assay for PKD inhibitiors-IC50 determinations
pH
7.2±n/a
Temperature
296.15±n/a K
IC50
6884.801388±n/a nM
Citation
 PubChem, PC Fluorescence polarization assay for PKD inhibitiors-IC50 determinations PubChem Bioassay (2008)[AID] 
Target
Name:
Serine/threonine-protein kinase D1
Synonyms:
KPCD1_HUMAN PKD1 PRKD1 Protein kinase C mu type Protein kinase C, PKC; classical/novel Protein kinase D (PRKD1) nPKC-D1 | nPKC-mu
Type:
Serine/threonine-protein kinase
Mol. Mass.:
101705.07
Organism:
Homo sapiens (Human)
Description:
gi_115529463
Residue:
912
  
Inhibitor
Name:
BDBM16173
Synonyms:
3,5-diamino-6-chloro-N-(diaminomethylene)pyrazinamide;hydrochloride Amiloride CHEMBL945
Type:
Small organic molecule
Emp. Form.:
C6H8ClN7O
Mol. Mass.:
229.627
SMILES:
NC(=N)NC(=O)c1nc(Cl)c(N)nc1N
:
Substrate
Name:
Substrate Peptide
Synonyms:
Type:
Peptide
Mol. Mass.:
358.43
Organism:
Description:
ATP as co-substrate
Residue:
3
NA