Target
Heat shock 70 kDa protein 1A
Ligand
BDBM32370
Substrate
BDBM10852
Meas. Tech.
HSP70 Biacore Direct Binding Assay
pH
7.4±n/a
Temperature
298.15±n/a K
Kd
11000±n/a nM
Citation
 Williamson, DSBorgognoni, JClay, ADaniels, ZDokurno, PDrysdale, MJFoloppe, NFrancis, GLGraham, CJHowes, RMacias, ATMurray, JBParsons, RShaw, TSurgenor, AETerry, LWang, YWood, MMassey, AJ Novel adenosine-derived inhibitors of 70 kDa heat shock protein, discovered through structure-based design. J Med Chem 52:1510-3 (2009)  
Target
Name:
Heat shock 70 kDa protein 1A
Synonyms:
HS71A_HUMAN HSP70.1 HSPA1 HSX70 Heat shock 70 kDa protein 1A/1B | Hsp70
Type:
Chaperone
Mol. Mass.:
70043.82
Organism:
Homo sapiens (Human)
Description:
Residue:
641
  
Inhibitor
Name:
BDBM32370
Synonyms:
adenosine-derived inhibitor (Grp78), 2 | adenosine-derived inhibitor, 4
Type:
Small organic molecule
Emp. Form.:
C10H14N6O4
Mol. Mass.:
282.256
SMILES:
Nc1nc2c(N)ncnc2n1[C@@H]1O[C@H](CO)[C@@H](O)[C@H]1O
:
Substrate