Target
Heat shock 70 kDa protein 1A
Ligand
BDBM32381
Substrate
BDBM10852
Meas. Tech.
HSP70 Biacore Direct Binding Assay
pH
7.4±n/a
Temperature
298.15±n/a K
Kd
50±n/a nM
Citation
 Williamson, DSBorgognoni, JClay, ADaniels, ZDokurno, PDrysdale, MJFoloppe, NFrancis, GLGraham, CJHowes, RMacias, ATMurray, JBParsons, RShaw, TSurgenor, AETerry, LWang, YWood, MMassey, AJ Novel adenosine-derived inhibitors of 70 kDa heat shock protein, discovered through structure-based design. J Med Chem 52:1510-3 (2009)  
Target
Name:
Heat shock 70 kDa protein 1A
Synonyms:
HS71A_HUMAN HSP70.1 HSPA1 HSX70 Heat shock 70 kDa protein 1A/1B | Hsp70
Type:
Chaperone
Mol. Mass.:
70043.82
Organism:
Homo sapiens (Human)
Description:
Residue:
641
  
Inhibitor
Name:
BDBM32381
Synonyms:
adenosine-derived inhibitor (Grp78), 14 | adenosine-derived inhibitor, 15
Type:
Small organic molecule
Emp. Form.:
C28H26N8O4
Mol. Mass.:
538.5572
SMILES:
Nc1ncnc2n([C@@H]3O[C@H](COCc4ccc(cc4)C#N)[C@@H](O)[C@H]3O)c(NCc3ccc4ncccc4c3)nc12
:
Substrate