Target
Genome polyprotein [1517-1688]/Mastoparan-2 [1420-1466]
Ligand
BDBM33247
Substrate
BDBM33421
Meas. Tech.
Tryptophan Fluorescence Quenching Assay (Kd)
pH
7.5±n/a
Temperature
298.15±n/a K
Kd
15000±1600 nM
Citation
 Ekonomiuk, DSu, XCOzawa, KBodenreider, CLim, SPOtting, GHuang, DCaflisch, A Flaviviral protease inhibitors identified by fragment-based library docking into a structure generated by molecular dynamics. J Med Chem 52:4860-8 (2009)  
Target
Name:
Genome polyprotein [1517-1688]/Mastoparan-2 [1420-1466]
Synonyms:
West Nile Virus (WNV) NS2B-NS3 Protease
Type:
Cofactor/Enzyme
Mol. Mass.:
Description:
Components:
This complex has 2 components.
Component 1
Name:
Mastoparan-2 [1420-1466]
Synonyms:
Flavivirin protease NS2B regulatory subunit NS2B
Type:
Cofactor Domain
Mol. Mass.:
6087.97
Organism:
West Nile virus (WNV)
Description:
P69035[1420-1466]
Residue:
54
  
Component 2
Name:
Genome polyprotein [1517-1688]
Synonyms:
Flavivirin protease NS3 catalytic subunit POLG_WNV
Type:
Catalytic Subunit
Mol. Mass.:
18566.91
Organism:
West Nile virus (WNV)
Description:
P06935[1517-1688]
Residue:
172
  
Inhibitor
Name:
BDBM33247
Synonyms:
benzenecarboximidamide, 1
Type:
Small organic molecule
Emp. Form.:
C15H16N6O
Mol. Mass.:
296.3271
SMILES:
NC(=N)c1cccc(NC(=O)Nc2cccc(c2)C(N)=N)c1
:
Substrate
Name:
BDBM33421
Synonyms:
noncovalently bound inhibitor
Type:
Emp. Form.:
Mol. Mass.:
SMILES:
: