Target
Prolyl hydroxylase EGLN3
Ligand
BDBM107704
Substrate
Meas. Tech.
EGLN-1 Activity Assay
IC50
390±n/a nM
Citation
 Kawamoto, RMWu, SEvdokimov, AGGreis, KDBoyer, ASWarshakoon, NC Prolyl hydroxylase inhibitors and methods of use US Patent  USRE47437 Publication Date 6/18/2019 
Target
Name:
Prolyl hydroxylase EGLN3
Synonyms:
EGLN3 Egl nine homolog 3 (EGLIN3) | Egl nine homolog 3 (EGLN3)
Type:
Protein
Mol. Mass.:
27265.54
Organism:
Homo sapiens (Human)
Description:
Q9H6Z9
Residue:
239
  
Inhibitor
Name:
BDBM107704
Synonyms:
US11426393, Compound Table XV.11 US8598210, Table XV, 10 US8722895, 10: {[5-(3-Chlorophenyl)-3-hydroxypyridine-2- carbonyl]amino}-acetic acid trifluoroacetic acid salt US9598370, Example 00136 | USRE47437, Example {[5-(3-Chlorophenyl)-3-hydroxypyridine-2-carbonyl]amino}-acetic acid
Type:
Small organic molecule
Emp. Form.:
C14H11ClN2O4
Mol. Mass.:
306.701
SMILES:
OC(=O)CNC(=O)c1ncc(cc1O)-c1cccc(Cl)c1
: