Target
Coagulation factor XII
Ligand
BDBM33423
Substrate
Boc-Gln-Gly-Arg-AMC
Meas. Tech.
Factor XIIa Dose Response Confirmation from Single Well HTS
pH
7.4±n/a
Temperature
296.15±n/a K
IC50
>50000±n/a nM
Citation
 PubChem, PC Factor XIIa Dose Response Confirmation from Single Well HTS PubChem Bioassay (2007)[AID] 
Target
Name:
Coagulation factor XII
Synonyms:
Beta-factor XIIa part 1 Carboxylesterase 2 (intestine, liver) Coagulation factor XII (FXII) Coagulation factor XIIa light chain FA12_HUMAN Factor XIIa (fXIIa) Hageman factor
Type:
Enzyme
Mol. Mass.:
67810.07
Organism:
Homo sapiens (Human)
Description:
P00748
Residue:
615
  
Inhibitor
Name:
BDBM33423
Synonyms:
Cyclobutanecarboxylic acid (4-oxo-3,4-dihydro-quinazolin-2-ylmethyl)-phenethyl-amide N-[(4-keto-1H-quinazolin-2-yl)methyl]-N-phenethyl-cyclobutanecarboxamide N-[(4-oxo-1H-quinazolin-2-yl)methyl]-N-(2-phenylethyl)cyclobutanecarboxamide cid_646331
Type:
Small organic molecule
Emp. Form.:
C22H23N3O2
Mol. Mass.:
361.4369
SMILES:
O=C(C1CCC1)N(CCc1ccccc1)Cc1nc2ccccc2c(=O)[nH]1
:
Substrate
Name:
Boc-Gln-Gly-Arg-AMC
Synonyms:
Type:
fluorescent substrate
Mol. Mass.:
358.43
Organism:
Description:
Residue:
3
NA