Target
Coagulation factor XII
Ligand
BDBM33439
Substrate
Boc-Gln-Gly-Arg-AMC
Meas. Tech.
Factor XIIa Dose Response Confirmation from Single Well HTS
pH
7.4±n/a
Temperature
296.15±n/a K
IC50
1524.03±n/a nM
Citation
 PubChem, PC Factor XIIa Dose Response Confirmation from Single Well HTS PubChem Bioassay (2007)[AID] 
Target
Name:
Coagulation factor XII
Synonyms:
Beta-factor XIIa part 1 Carboxylesterase 2 (intestine, liver) Coagulation factor XII (FXII) Coagulation factor XIIa light chain FA12_HUMAN Factor XIIa (fXIIa) Hageman factor
Type:
Enzyme
Mol. Mass.:
67810.07
Organism:
Homo sapiens (Human)
Description:
P00748
Residue:
615
  
Inhibitor
Name:
BDBM33439
Synonyms:
1-(5-amino-3-pyridin-3-yl-1,2,4-triazol-1-yl)-2-phenylethanone 1-(phenylacetyl)-3-(3-pyridinyl)-1H-1,2,4-triazol-5-amine 1-[5-amino-3-(3-pyridyl)-1,2,4-triazol-1-yl]-2-phenyl-ethanone SMR000077068 | cid_971620
Type:
Small organic molecule
Emp. Form.:
C15H13N5O
Mol. Mass.:
279.2966
SMILES:
Nc1nc(nn1C(=O)Cc1ccccc1)-c1cccnc1
:
Substrate
Name:
Boc-Gln-Gly-Arg-AMC
Synonyms:
Type:
fluorescent substrate
Mol. Mass.:
358.43
Organism:
Description:
Residue:
3
NA