Target
Coagulation factor XII
Ligand
BDBM32675
Substrate
Boc-Gln-Gly-Arg-AMC
Meas. Tech.
Factor XIIa Dose Response Confirmation from Single Well HTS
pH
7.4±n/a
Temperature
296.15±n/a K
IC50
10687.73333±n/a nM
Citation
 PubChem, PC Factor XIIa Dose Response Confirmation from Single Well HTS PubChem Bioassay (2007)[AID] 
Target
Name:
Coagulation factor XII
Synonyms:
Beta-factor XIIa part 1 Carboxylesterase 2 (intestine, liver) Coagulation factor XII (FXII) Coagulation factor XIIa light chain FA12_HUMAN Factor XIIa (fXIIa) Hageman factor
Type:
Enzyme
Mol. Mass.:
67810.07
Organism:
Homo sapiens (Human)
Description:
P00748
Residue:
615
  
Inhibitor
Name:
BDBM32675
Synonyms:
1-(3-bromo-4-methoxybenzoyl)-1H-1,2,3-benzotriazole MLS000048314 benzotriazol-1-yl-(3-bromanyl-4-methoxy-phenyl)methanone benzotriazol-1-yl-(3-bromo-4-methoxyphenyl)methanone | cid_833492
Type:
Small organic molecule
Emp. Form.:
C14H10BrN3O2
Mol. Mass.:
332.152
SMILES:
COc1ccc(cc1Br)C(=O)n1nnc2ccccc12
:
Substrate
Name:
Boc-Gln-Gly-Arg-AMC
Synonyms:
Type:
fluorescent substrate
Mol. Mass.:
358.43
Organism:
Description:
Residue:
3
NA