Target
Coagulation factor XII
Ligand
BDBM33442
Substrate
Boc-Gln-Gly-Arg-AMC
Meas. Tech.
Factor XIIa Dose Response Confirmation from Single Well HTS
pH
7.4±n/a
Temperature
296.15±n/a K
IC50
18527.74333±n/a nM
Citation
 PubChem, PC Factor XIIa Dose Response Confirmation from Single Well HTS PubChem Bioassay (2007)[AID] 
Target
Name:
Coagulation factor XII
Synonyms:
Beta-factor XIIa part 1 Carboxylesterase 2 (intestine, liver) Coagulation factor XII (FXII) Coagulation factor XIIa light chain FA12_HUMAN Factor XIIa (fXIIa) Hageman factor
Type:
Enzyme
Mol. Mass.:
67810.07
Organism:
Homo sapiens (Human)
Description:
P00748
Residue:
615
  
Inhibitor
Name:
BDBM33442
Synonyms:
(4-acetylphenyl) 5-bromofuran-2-carboxylate 5-bromo-2-furancarboxylic acid (4-acetylphenyl) ester MLS000105128 cid_786607
Type:
Small organic molecule
Emp. Form.:
C13H9BrO4
Mol. Mass.:
309.112
SMILES:
CC(=O)c1ccc(OC(=O)c2ccc(Br)o2)cc1
:
Substrate
Name:
Boc-Gln-Gly-Arg-AMC
Synonyms:
Type:
fluorescent substrate
Mol. Mass.:
358.43
Organism:
Description:
Residue:
3
NA