Target
Coagulation factor XII
Ligand
BDBM33445
Substrate
Boc-Gln-Gly-Arg-AMC
Meas. Tech.
Factor XIIa Dose Response Confirmation from Single Well HTS
pH
7.4±n/a
Temperature
296.15±n/a K
IC50
7888.5±n/a nM
Citation
 PubChem, PC Factor XIIa Dose Response Confirmation from Single Well HTS PubChem Bioassay (2007)[AID] 
Target
Name:
Coagulation factor XII
Synonyms:
Beta-factor XIIa part 1 Carboxylesterase 2 (intestine, liver) Coagulation factor XII (FXII) Coagulation factor XIIa light chain FA12_HUMAN Factor XIIa (fXIIa) Hageman factor
Type:
Enzyme
Mol. Mass.:
67810.07
Organism:
Homo sapiens (Human)
Description:
P00748
Residue:
615
  
Inhibitor
Name:
BDBM33445
Synonyms:
(3,5-Dimethoxy-phenyl)-(3,5-dimethyl-pyrazol-1-yl)-methanone (3,5-dimethoxyphenyl)-(3,5-dimethylpyrazol-1-yl)methanone SMR000116682 | cid_754128
Type:
Small organic molecule
Emp. Form.:
C14H16N2O3
Mol. Mass.:
260.2884
SMILES:
COc1cc(OC)cc(c1)C(=O)n1nc(C)cc1C
:
Substrate
Name:
Boc-Gln-Gly-Arg-AMC
Synonyms:
Type:
fluorescent substrate
Mol. Mass.:
358.43
Organism:
Description:
Residue:
3
NA