Target
Coagulation factor XII
Ligand
BDBM33447
Substrate
Boc-Gln-Gly-Arg-AMC
Meas. Tech.
Factor XIIa Dose Response Confirmation from Single Well HTS
pH
7.4±n/a
Temperature
296.15±n/a K
IC50
6221.753333±n/a nM
Citation
 PubChem, PC Factor XIIa Dose Response Confirmation from Single Well HTS PubChem Bioassay (2007)[AID] 
Target
Name:
Coagulation factor XII
Synonyms:
Beta-factor XIIa part 1 Carboxylesterase 2 (intestine, liver) Coagulation factor XII (FXII) Coagulation factor XIIa light chain FA12_HUMAN Factor XIIa (fXIIa) Hageman factor
Type:
Enzyme
Mol. Mass.:
67810.07
Organism:
Homo sapiens (Human)
Description:
P00748
Residue:
615
  
Inhibitor
Name:
BDBM33447
Synonyms:
(4-oxidanylidene-2,3-dihydro-1H-cyclopenta[c]chromen-7-yl) furan-2-carboxylate 2-furancarboxylic acid (4-oxo-2,3-dihydro-1H-cyclopenta[c][1]benzopyran-7-yl) ester MLS000526449 cid_718321 | furan-2-carboxylic acid (4-keto-2,3-dihydro-1H-cyclopenta[c]chromen-7-yl) ester
Type:
Small organic molecule
Emp. Form.:
C17H12O5
Mol. Mass.:
296.2742
SMILES:
O=C(Oc1ccc2c3CCCc3c(=O)oc2c1)c1ccco1
:
Substrate
Name:
Boc-Gln-Gly-Arg-AMC
Synonyms:
Type:
fluorescent substrate
Mol. Mass.:
358.43
Organism:
Description:
Residue:
3
NA