Target
Coagulation factor XII
Ligand
BDBM32695
Substrate
Boc-Gln-Gly-Arg-AMC
Meas. Tech.
Factor XIIa Dose Response Confirmation from Single Well HTS
pH
7.4±n/a
Temperature
296.15±n/a K
IC50
12370.60667±n/a nM
Citation
 PubChem, PC Factor XIIa Dose Response Confirmation from Single Well HTS PubChem Bioassay (2007)[AID] 
Target
Name:
Coagulation factor XII
Synonyms:
Beta-factor XIIa part 1 Carboxylesterase 2 (intestine, liver) Coagulation factor XII (FXII) Coagulation factor XIIa light chain FA12_HUMAN Factor XIIa (fXIIa) Hageman factor
Type:
Enzyme
Mol. Mass.:
67810.07
Organism:
Homo sapiens (Human)
Description:
P00748
Residue:
615
  
Inhibitor
Name:
BDBM32695
Synonyms:
2-furancarboxylic acid [3-(1-tetrazolyl)phenyl] ester MLS000527366 [3-(1,2,3,4-tetrazol-1-yl)phenyl] furan-2-carboxylate cid_856198 | furan-2-carboxylic acid [3-(tetrazol-1-yl)phenyl] ester
Type:
Small organic molecule
Emp. Form.:
C12H8N4O3
Mol. Mass.:
256.2169
SMILES:
O=C(Oc1cccc(c1)-n1cnnn1)c1ccco1
:
Substrate
Name:
Boc-Gln-Gly-Arg-AMC
Synonyms:
Type:
fluorescent substrate
Mol. Mass.:
358.43
Organism:
Description:
Residue:
3
NA