Target
Coagulation factor XII
Ligand
BDBM33453
Substrate
Boc-Gln-Gly-Arg-AMC
Meas. Tech.
Factor XIIa Dose Response Confirmation from Single Well HTS
pH
7.4±n/a
Temperature
296.15±n/a K
IC50
7588.073333±n/a nM
Citation
 PubChem, PC Factor XIIa Dose Response Confirmation from Single Well HTS PubChem Bioassay (2007)[AID] 
Target
Name:
Coagulation factor XII
Synonyms:
Beta-factor XIIa part 1 Carboxylesterase 2 (intestine, liver) Coagulation factor XII (FXII) Coagulation factor XIIa light chain FA12_HUMAN Factor XIIa (fXIIa) Hageman factor
Type:
Enzyme
Mol. Mass.:
67810.07
Organism:
Homo sapiens (Human)
Description:
P00748
Residue:
615
  
Inhibitor
Name:
BDBM33453
Synonyms:
(3-Amino-[1,2,4]triazol-4-yl)-(4-methoxy-phenyl)-methanone (3-azanyl-1,2,4-triazol-4-yl)-(4-methoxyphenyl)methanone SMR000121258 | cid_2938648
Type:
Small organic molecule
Emp. Form.:
C10H10N4O2
Mol. Mass.:
218.212
SMILES:
COc1ccc(cc1)C(=O)n1cnnc1N
:
Substrate
Name:
Boc-Gln-Gly-Arg-AMC
Synonyms:
Type:
fluorescent substrate
Mol. Mass.:
358.43
Organism:
Description:
Residue:
3
NA