Target
Coagulation factor XII
Ligand
BDBM32709
Substrate
Boc-Gln-Gly-Arg-AMC
Meas. Tech.
Factor XIIa Dose Response Confirmation from Single Well HTS
pH
7.4±n/a
Temperature
296.15±n/a K
IC50
795.836667±n/a nM
Citation
 PubChem, PC Factor XIIa Dose Response Confirmation from Single Well HTS PubChem Bioassay (2007)[AID] 
Target
Name:
Coagulation factor XII
Synonyms:
Beta-factor XIIa part 1 Carboxylesterase 2 (intestine, liver) Coagulation factor XII (FXII) Coagulation factor XIIa light chain FA12_HUMAN Factor XIIa (fXIIa) Hageman factor
Type:
Enzyme
Mol. Mass.:
67810.07
Organism:
Homo sapiens (Human)
Description:
P00748
Residue:
615
  
Inhibitor
Name:
BDBM32709
Synonyms:
(5-amino-3-pyridin-3-yl-1,2,4-triazol-1-yl)-(4-methylphenyl)methanone 1-(4-methylbenzoyl)-3-(3-pyridinyl)-1H-1,2,4-triazol-5-amine SMR000144080 [5-amino-3-(3-pyridyl)-1,2,4-triazol-1-yl]-(p-tolyl)methanone | cid_970375
Type:
Small organic molecule
Emp. Form.:
C15H13N5O
Mol. Mass.:
279.2966
SMILES:
Cc1ccc(cc1)C(=O)n1nc(nc1N)-c1cccnc1
:
Substrate
Name:
Boc-Gln-Gly-Arg-AMC
Synonyms:
Type:
fluorescent substrate
Mol. Mass.:
358.43
Organism:
Description:
Residue:
3
NA