Target
Coagulation factor XII
Ligand
BDBM32713
Substrate
Boc-Gln-Gly-Arg-AMC
Meas. Tech.
Factor XIIa Dose Response Confirmation from Single Well HTS
pH
7.4±n/a
Temperature
296.15±n/a K
IC50
9179.693333±n/a nM
Citation
 PubChem, PC Factor XIIa Dose Response Confirmation from Single Well HTS PubChem Bioassay (2007)[AID] 
Target
Name:
Coagulation factor XII
Synonyms:
Beta-factor XIIa part 1 Carboxylesterase 2 (intestine, liver) Coagulation factor XII (FXII) Coagulation factor XIIa light chain FA12_HUMAN Factor XIIa (fXIIa) Hageman factor
Type:
Enzyme
Mol. Mass.:
67810.07
Organism:
Homo sapiens (Human)
Description:
P00748
Residue:
615
  
Inhibitor
Name:
BDBM32713
Synonyms:
(3-amino-1,2,4-triazol-4-yl)-(4-methylphenyl)methanone (3-azanyl-1,2,4-triazol-4-yl)-(4-methylphenyl)methanone MLS000537289 cid_892616
Type:
Small organic molecule
Emp. Form.:
C10H10N4O
Mol. Mass.:
202.2126
SMILES:
Cc1ccc(cc1)C(=O)n1cnnc1N
:
Substrate
Name:
Boc-Gln-Gly-Arg-AMC
Synonyms:
Type:
fluorescent substrate
Mol. Mass.:
358.43
Organism:
Description:
Residue:
3
NA