Target
Coagulation factor XII
Ligand
BDBM33464
Substrate
Boc-Gln-Gly-Arg-AMC
Meas. Tech.
Factor XIIa Dose Response Confirmation from Single Well HTS
pH
7.4±n/a
Temperature
296.15±n/a K
IC50
1943.443333±n/a nM
Citation
 PubChem, PC Factor XIIa Dose Response Confirmation from Single Well HTS PubChem Bioassay (2007)[AID] 
Target
Name:
Coagulation factor XII
Synonyms:
Beta-factor XIIa part 1 Carboxylesterase 2 (intestine, liver) Coagulation factor XII (FXII) Coagulation factor XIIa light chain FA12_HUMAN Factor XIIa (fXIIa) Hageman factor
Type:
Enzyme
Mol. Mass.:
67810.07
Organism:
Homo sapiens (Human)
Description:
P00748
Residue:
615
  
Inhibitor
Name:
BDBM33464
Synonyms:
2,6-dimethylbenzo-1,4-quinone 4-[O-(3-nitrobenzoyl)oxime] 3-nitrobenzoic acid [(4-keto-3,5-dimethyl-cyclohexa-2,5-dien-1-ylidene)amino] ester SMR000141463 [(3,5-dimethyl-4-oxocyclohexa-2,5-dien-1-ylidene)amino] 3-nitrobenzoate | cid_885433
Type:
Small organic molecule
Emp. Form.:
C15H12N2O5
Mol. Mass.:
300.2662
SMILES:
[#6]-[#6]-1=[#6]\[#6](-[#6]=[#6](-[#6])-[#6]-1=O)=[#7]\[#8]-[#6](=O)-c1cccc(c1)-[#7+](-[#8-])=O
:
Substrate
Name:
Boc-Gln-Gly-Arg-AMC
Synonyms:
Type:
fluorescent substrate
Mol. Mass.:
358.43
Organism:
Description:
Residue:
3
NA