Target
Coagulation factor XII
Ligand
BDBM32722
Substrate
Boc-Gln-Gly-Arg-AMC
Meas. Tech.
Factor XIIa Dose Response Confirmation from Single Well HTS
pH
7.4±n/a
Temperature
296.15±n/a K
IC50
3957.196667±n/a nM
Citation
 PubChem, PC Factor XIIa Dose Response Confirmation from Single Well HTS PubChem Bioassay (2007)[AID] 
Target
Name:
Coagulation factor XII
Synonyms:
Beta-factor XIIa part 1 Carboxylesterase 2 (intestine, liver) Coagulation factor XII (FXII) Coagulation factor XIIa light chain FA12_HUMAN Factor XIIa (fXIIa) Hageman factor
Type:
Enzyme
Mol. Mass.:
67810.07
Organism:
Homo sapiens (Human)
Description:
P00748
Residue:
615
  
Inhibitor
Name:
BDBM32722
Synonyms:
(4-chlorophenyl)-[3-(2-furanyl)-5-(methylthio)-1,2,4-triazol-1-yl]methanone (4-chlorophenyl)-[3-(furan-2-yl)-5-methylsulfanyl-1,2,4-triazol-1-yl]methanone SMR000127548 | cid_3586641
Type:
Small organic molecule
Emp. Form.:
C14H10ClN3O2S
Mol. Mass.:
319.766
SMILES:
CSc1nc(nn1C(=O)c1ccc(Cl)cc1)-c1ccco1
:
Substrate
Name:
Boc-Gln-Gly-Arg-AMC
Synonyms:
Type:
fluorescent substrate
Mol. Mass.:
358.43
Organism:
Description:
Residue:
3
NA