Target
Coagulation factor XII
Ligand
BDBM32728
Substrate
Boc-Gln-Gly-Arg-AMC
Meas. Tech.
Factor XIIa Dose Response Confirmation from Single Well HTS
pH
7.4±n/a
Temperature
296.15±n/a K
IC50
3926.52±n/a nM
Citation
 PubChem, PC Factor XIIa Dose Response Confirmation from Single Well HTS PubChem Bioassay (2007)[AID] 
Target
Name:
Coagulation factor XII
Synonyms:
Beta-factor XIIa part 1 Carboxylesterase 2 (intestine, liver) Coagulation factor XII (FXII) Coagulation factor XIIa light chain FA12_HUMAN Factor XIIa (fXIIa) Hageman factor
Type:
Enzyme
Mol. Mass.:
67810.07
Organism:
Homo sapiens (Human)
Description:
P00748
Residue:
615
  
Inhibitor
Name:
BDBM32728
Synonyms:
1-benzotriazolyl-[3-(3-methoxyphenyl)-1-phenyl-4-pyrazolyl]methanone MLS000536916 benzotriazol-1-yl-[3-(3-methoxyphenyl)-1-phenyl-pyrazol-4-yl]methanone cid_2140154
Type:
Small organic molecule
Emp. Form.:
C23H17N5O2
Mol. Mass.:
395.4134
SMILES:
COc1cccc(c1)-c1nn(cc1C(=O)n1nnc2ccccc12)-c1ccccc1
:
Substrate
Name:
Boc-Gln-Gly-Arg-AMC
Synonyms:
Type:
fluorescent substrate
Mol. Mass.:
358.43
Organism:
Description:
Residue:
3
NA