Target
Coagulation factor XII
Ligand
BDBM33481
Substrate
Boc-Gln-Gly-Arg-AMC
Meas. Tech.
Factor XIIa Dose Response Confirmation from Single Well HTS
pH
7.4±n/a
Temperature
296.15±n/a K
IC50
92.446667±n/a nM
Citation
 PubChem, PC Factor XIIa Dose Response Confirmation from Single Well HTS PubChem Bioassay (2007)[AID] 
Target
Name:
Coagulation factor XII
Synonyms:
Beta-factor XIIa part 1 Carboxylesterase 2 (intestine, liver) Coagulation factor XII (FXII) Coagulation factor XIIa light chain FA12_HUMAN Factor XIIa (fXIIa) Hageman factor
Type:
Enzyme
Mol. Mass.:
67810.07
Organism:
Homo sapiens (Human)
Description:
P00748
Residue:
615
  
Inhibitor
Name:
BDBM33481
Synonyms:
3-benzamido-1H-1,2,4-triazole-5-carboxylic acid methyl ester SMR000151640 methyl 3-benzamido-1H-1,2,4-triazole-5-carboxylate
Type:
Small organic molecule
Emp. Form.:
C11H10N4O3
Mol. Mass.:
246.2221
SMILES:
COC(=O)c1nnc(NC(=O)c2ccccc2)[nH]1
:
Substrate
Name:
Boc-Gln-Gly-Arg-AMC
Synonyms:
Type:
fluorescent substrate
Mol. Mass.:
358.43
Organism:
Description:
Residue:
3
NA