Target
Serine/threonine-protein kinase B-raf [V600E]
Ligand
BDBM35321
Substrate
biotin-MEK
Meas. Tech.
In Vitro BRAF Kinase Assay
pH
7±n/a
Temperature
296.15±n/a K
IC50
39±n/a nM
EC50
44±n/a nM
Citation
 Smith, ALDeMorin, FFParas, NAHuang, QPetkus, JKDoherty, EMNixey, TKim, JLWhittington, DAEpstein, LFLee, MRRose, MJBabij, CFernando, MHess, KLe, QBeltran, PCarnahan, J Selective inhibitors of the mutant B-Raf pathway: discovery of a potent and orally bioavailable aminoisoquinoline. J Med Chem 52:6189-92 (2009)  
Target
Name:
Serine/threonine-protein kinase B-raf [V600E]
Synonyms:
B-RAF V600E B-Raf Protein Kinase Mutant (V600E) BRAF BRAF mutant V600E BRAF_HUMAN Protein mono-ADP-ribosyltransferase (PARP3) RAFB1 Serine/threonine-protein kinase B-raf (V600E) V-RAF murine sarcoma viral oncogene homologue B1 mutant (BRAF V600E)
Type:
Mol. Mass.:
84474.98
Organism:
Homo sapiens (Human)
Description:
P15056 V600E
Residue:
766
  
Inhibitor
Name:
BDBM35321
Synonyms:
aminoisoquinoline, 14
Type:
Small organic molecule
Emp. Form.:
C27H22N8
Mol. Mass.:
458.5172
SMILES:
CNc1cc(ncn1)-c1cccnc1Nc1c(C)ccc2c(Nc3ccc(cc3)C#N)nccc12
:
Substrate
Name:
biotin-MEK
Synonyms:
Type:
biotinylated substrate
Mol. Mass.:
358.43
Organism:
Description:
Perkin-Elmer s AlphaScreen assay kit.
Residue:
3
NA