Target
Dimer of Gag-Pol polyprotein [514-612]
Ligand
BDBM926
Substrate
HIV Protease Peptide Substrate
Meas. Tech.
Protease Inhibition Assay
pH
4.7±n/a
Temperature
310.15±n/a K
Ki
180±n/a nM
Citation
 Scholz, DBillich, ACharpiot, BEttmayer, PLehr, PRosenwirth, BSchreiner, EGstach, H Inhibitors of HIV-1 proteinase containing 2-heterosubstituted 4-amino-3-hydroxy-5-phenylpentanoic acid: synthesis, enzyme inhibition, and antiviral activity. J Med Chem 37:3079-89 (1994)  
Target
Name:
Dimer of Gag-Pol polyprotein [514-612]
Synonyms:
HIV-2 Protease
Type:
Protein Complex
Mol. Mass.:
Description:
Components:
This complex has 2 components.
Component 1
Name:
Gag-Pol polyprotein [514-612]
Synonyms:
HIV-2 Protease chain A POL_HV2RO | gag-pol
Type:
Enzyme Subunit
Mol. Mass.:
10718.25
Organism:
Human immunodeficiency virus type 2
Description:
P04584[514-612]
Residue:
99
  
Component 2
Name:
Gag-Pol polyprotein [514-612]
Synonyms:
HIV-2 Protease chain A POL_HV2RO | gag-pol
Type:
Enzyme Subunit
Mol. Mass.:
10718.25
Organism:
Human immunodeficiency virus type 2
Description:
P04584[514-612]
Residue:
99
  
Inhibitor
Name:
BDBM926
Synonyms:
5PhBuCOOH deriv. Tle-Val-Sta | benzyl N-[(1S)-1-{[(2S,3R,4R)-4-(benzylamino)-4-{[(1S)-1-(benzylcarbamoyl)-2-methylpropyl]carbamoyl}-3-hydroxy-1-phenylbutan-2-yl]carbamoyl}-2-methylpropyl]carbamate
Type:
Small organic molecule
Emp. Form.:
C43H53N5O6
Mol. Mass.:
735.9108
SMILES:
CC(C)[C@H](NC(=O)OCc1ccccc1)C(=O)N[C@@H](Cc1ccccc1)[C@@H](O)[C@@H](NCc1ccccc1)C(=O)N[C@@H](C(C)C)C(=O)NCc1ccccc1
:
Substrate
Name:
HIV Protease Peptide Substrate
Synonyms:
Type:
Peptide
Mol. Mass.:
3062.94
Organism:
Synthesized
Description:
Residue:
29