Target
Dimer of Gag-Pol polyprotein [514-612]
Ligand
BDBM964
Substrate
HIV Protease Peptide Substrate
Meas. Tech.
Protease Inhibition Assay
Ki
120±n/a nM
Citation
 Scholz, DBillich, ACharpiot, BEttmayer, PLehr, PRosenwirth, BSchreiner, EGstach, H Inhibitors of HIV-1 proteinase containing 2-heterosubstituted 4-amino-3-hydroxy-5-phenylpentanoic acid: synthesis, enzyme inhibition, and antiviral activity. J Med Chem 37:3079-89 (1994)  
Target
Name:
Dimer of Gag-Pol polyprotein [514-612]
Synonyms:
HIV-2 Protease
Type:
Protein Complex
Mol. Mass.:
Description:
Components:
This complex has 2 components.
Component 1
Name:
Gag-Pol polyprotein [514-612]
Synonyms:
HIV-2 Protease chain A POL_HV2RO | gag-pol
Type:
Enzyme Subunit
Mol. Mass.:
10718.25
Organism:
Human immunodeficiency virus type 2
Description:
P04584[514-612]
Residue:
99
  
Component 2
Name:
Gag-Pol polyprotein [514-612]
Synonyms:
HIV-2 Protease chain A POL_HV2RO | gag-pol
Type:
Enzyme Subunit
Mol. Mass.:
10718.25
Organism:
Human immunodeficiency virus type 2
Description:
P04584[514-612]
Residue:
99
  
Inhibitor
Name:
BDBM964
Synonyms:
2-Aminobenzyl-Substituted AHPPA deriv. 1 Statine deriv. 47 benzyl N-[(1S)-1-{[(2S,3R,4R)-4-{[(1S)-1-[(1H-1,3-benzodiazol-2-ylmethyl)carbamoyl]-2-methylpropyl]carbamoyl}-3-hydroxy-4-{[(4-methoxyphenyl)methyl]amino}-1-phenylbutan-2-yl]carbamoyl}-2-methylpropyl]carbamate
Type:
Small organic molecule
Emp. Form.:
C45H55N7O7
Mol. Mass.:
805.9609
SMILES:
COc1ccc(CN[C@H]([C@H](O)[C@H](Cc2ccccc2)NC(=O)[C@@H](NC(=O)OCc2ccccc2)C(C)C)C(=O)N[C@@H](C(C)C)C(=O)NCc2nc3ccccc3[nH]2)cc1
:
Substrate
Name:
HIV Protease Peptide Substrate
Synonyms:
Type:
Peptide
Mol. Mass.:
3062.94
Organism:
Synthesized
Description:
Residue:
29