Target
Dual specificity protein kinase TTK
Ligand
BDBM36485
Substrate
Meas. Tech.
Mps1 Kinase Inhibition Activity Assay
pH
7.5±0
Temperature
273.15±n/a K
IC50
367±0.0 nM
Citation
 Kwiatkowski, NJelluma, NFilippakopoulos, PSoundararajan, MManak, MSKwon, MChoi, HGSim, TDeveraux, QLRottmann, SPellman, DShah, JVKops, GJKnapp, SGray, NS Small-molecule kinase inhibitors provide insight into Mps1 cell cycle function. Nat Chem Biol 6:359-68 (2010)  
Target
Name:
Dual specificity protein kinase TTK
Synonyms:
Dual specificity protein kinase (TTK) MPS1 Monopolar Spindle 1 (MPS1) Monopolar Spindle 1 Kinase (MPS1) TTK | TTK_HUMAN
Type:
Protein
Mol. Mass.:
97086.79
Organism:
Homo sapiens (Human)
Description:
P33981
Residue:
857
  
Inhibitor
Name:
BDBM36485
Synonyms:
1-(4-(4-(2-(Isopropylsulfonyl)phenylamino)-1H-pyrrolo[2,3-b]pyridin-6-ylamino)-3-methoxyphenyl)piperidin-4-ol US11208696, Example 30
Type:
Small organic molecule
Emp. Form.:
C28H33N5O4S
Mol. Mass.:
535.658
SMILES:
COc1cc(ccc1Nc1cc(Nc2ccccc2S(=O)(=O)C(C)C)c2cc[nH]c2n1)N1CCC(O)CC1
: