Target
Methionine aminopeptidase 2
Ligand
BDBM36594
Substrate
Meas. Tech.
Proliferation Assay
pH
7.5±0
EC50
2800±2300 nM
Citation
 Griffith, ECSu, ZTurk, BEChen, SChang, YHWu, ZBiemann, KLiu, JO Methionine aminopeptidase (type 2) is the common target for angiogenesis inhibitors AGM-1470 and ovalicin. Chem Biol 4:461-71 (1997)  
Target
Name:
Methionine aminopeptidase 2
Synonyms:
MAP2_MOUSE Methionine aminopeptidase Type 2 (MetAP2) P67eif2 | Peptidase M 2
Type:
Enzyme
Mol. Mass.:
52914.64
Organism:
Mus musculus (Mouse)
Description:
O08663
Residue:
478
  
Inhibitor
Name:
BDBM36594
Synonyms:
FOS-202
Type:
Small organic molecule
Emp. Form.:
C16H28O4S
Mol. Mass.:
316.456
SMILES:
[#6]-[#8]-[#6@@H]-1-[#6@H](-[#8])-[#6]-[#6][C@]([#8])([#16]-[#6])[#6]-1[C@]1([#6])[#8]-[#6]1-[#6]\[#6]=[#6](\[#6])-[#6]
: