Target
Protein kinase C beta type
Ligand
BDBM36604
Substrate
Meas. Tech.
Inhibition Assay
pH
7.5±0
Temperature
303.15±0 K
Ki
69±0 nM
IC50
95±0.0 nM
Citation
 Koide, KBunnage, MEGomez Paloma, LKanter, JRTaylor, SSBrunton, LLNicolaou, KC Molecular design and biological activity of potent and selective protein kinase inhibitors related to balanol. Chem Biol 2:601-8 (1995)  
Target
Name:
Protein kinase C beta type
Synonyms:
KPCB_RAT Pkcb Prkcb1 Protein kinase C (PKC) | Protein kinase C beta
Type:
Enzyme Mixture
Mol. Mass.:
76755.54
Organism:
Rattus norvegicus (rat)
Description:
PKC from rat brain is known to contain predominately the conventional PKC isoforms, alpha, beta I, beta II, gamma.
Residue:
671
  
Inhibitor
Name:
BDBM36604
Synonyms:
5'-Deoxybalanol, 7
Type:
Small organic molecule
Emp. Form.:
C28H26N2O9
Mol. Mass.:
534.514
SMILES:
OC(=O)c1cccc(O)c1C(=O)c1c(O)cc(cc1O)C(=O)O[C@@H]1CCCNC[C@H]1NC(=O)c1ccccc1
: