Target
Protein kinase C beta type
Ligand
BDBM3149
Substrate
Meas. Tech.
Inhibition Assay
Temperature
303.15±0 K
Ki
5.3±1.8 nM
Citation
 Koide, KBunnage, MEGomez Paloma, LKanter, JRTaylor, SSBrunton, LLNicolaou, KC Molecular design and biological activity of potent and selective protein kinase inhibitors related to balanol. Chem Biol 2:601-8 (1995)  
Target
Name:
Protein kinase C beta type
Synonyms:
KPCB_RAT Pkcb Prkcb1 Protein kinase C (PKC) | Protein kinase C beta
Type:
Enzyme Mixture
Mol. Mass.:
76755.54
Organism:
Rattus norvegicus (rat)
Description:
PKC from rat brain is known to contain predominately the conventional PKC isoforms, alpha, beta I, beta II, gamma.
Residue:
671
  
Inhibitor
Name:
BDBM3149
Synonyms:
2-{[2,6-dihydroxy-4-({[(3R,4R)-3-[(4-hydroxybenzene)amido]azepan-4-yl]oxy}carbonyl)phenyl]carbonyl}-3-hydroxybenzoic acid Balanol analog 1 CHEMBL60254
Type:
Small organic molecule
Emp. Form.:
C28H26N2O10
Mol. Mass.:
550.5134
SMILES:
OC(=O)c1cccc(O)c1C(=O)c1c(O)cc(cc1O)C(=O)O[C@@H]1CCCNC[C@H]1NC(=O)c1ccc(O)cc1
: