Target
Protein kinase C beta type
Ligand
BDBM36600
Substrate
Meas. Tech.
Inhibition Assay
pH
7.5±0
Temperature
303.15±0 K
Ki
>10e5±0 nM
Citation
 Koide, KBunnage, MEGomez Paloma, LKanter, JRTaylor, SSBrunton, LLNicolaou, KC Molecular design and biological activity of potent and selective protein kinase inhibitors related to balanol. Chem Biol 2:601-8 (1995)  
Target
Name:
Protein kinase C beta type
Synonyms:
KPCB_RAT Pkcb Prkcb1 Protein kinase C (PKC) | Protein kinase C beta
Type:
Enzyme Mixture
Mol. Mass.:
76755.54
Organism:
Rattus norvegicus (rat)
Description:
PKC from rat brain is known to contain predominately the conventional PKC isoforms, alpha, beta I, beta II, gamma.
Residue:
671
  
Inhibitor
Name:
BDBM36600
Synonyms:
Benzophenone fragment, 2
Type:
Small organic molecule
Emp. Form.:
C16H12O8
Mol. Mass.:
332.2617
SMILES:
COC(=O)c1cc(O)c(C(=O)c2c(O)cccc2C(O)=O)c(O)c1
: