Target
Fibroblast growth factor receptor 1
Ligand
BDBM24773
Substrate
Meas. Tech.
Kinase Inhibitor Selectivity Profiling Assay
Kd
6200±n/a nM
Citation
 PubChem, PC Kinase Inhibitor Selectivity Profiling Assay PubChem Bioassay (2008)[AID] 
Target
Name:
Fibroblast growth factor receptor 1
Synonyms:
BFGFR Basic fibroblast growth factor receptor 1 (FGFR1) CEK FGFR-1 FGFR-1, (FL) FGFR1_HUMAN FLT2 Fibroblast growth factor receptor 1 (FGFR-1) Fms-like tyrosine kinase 2 N-sam bFGF-R | c-fgr
Type:
Receptor
Mol. Mass.:
91861.70
Organism:
Homo sapiens (Human)
Description:
P11362
Residue:
822
  
Inhibitor
Name:
BDBM24773
Synonyms:
AMG 706 Motesanib N-(3,3-dimethyl-1,2-dihydroindol-6-yl)-2-(pyridin-4-ylmethylamino)pyridine-3-carboxamide N-(3,3-dimethylindolin-6-yl)-2-(4-pyridylmethylamino)nicotinamide cid_11667893
Type:
Small organic molecule
Emp. Form.:
C22H23N5O
Mol. Mass.:
373.4509
SMILES:
CC1(C)CNc2cc(NC(=O)c3cccnc3NCc3ccncc3)ccc12
: