Target
Calcium/calmodulin-dependent protein kinase type 1
Ligand
BDBM31096
Substrate
Meas. Tech.
Kinase Inhibitor Selectivity Profiling Assay
Kd
27±n/a nM
Citation
 PubChem, PC Kinase Inhibitor Selectivity Profiling Assay PubChem Bioassay (2008)[AID] 
Target
Name:
Calcium/calmodulin-dependent protein kinase type 1
Synonyms:
CAMK1 CaM kinase I alpha CaMKI-alpha KCC1A_HUMAN
Type:
PROTEIN
Mol. Mass.:
41325.04
Organism:
Homo sapiens (Human)
Description:
ChEMBL_655701
Residue:
370
  
Inhibitor
Name:
BDBM31096
Synonyms:
CHEMBL290084 cid_451705
Type:
Small organic molecule
Emp. Form.:
C28H26N4O3
Mol. Mass.:
466.531
SMILES:
CN[C@H]1C[C@@H]2O[C@](C)([C@H]1OC)n1c3ccccc3c3c4CNC(=O)c4c4c5ccccc5n2c4c13
: