Target
Epidermal growth factor receptor [1-999,L858R]
Ligand
BDBM31340
Substrate
Meas. Tech.
Kinase Inhibitor Selectivity Profiling Assay
Kd
110000±n/a nM
Citation
 PubChem, PC Kinase Inhibitor Selectivity Profiling Assay PubChem Bioassay (2008)[AID] 
Target
Name:
Epidermal growth factor receptor [1-999,L858R]
Synonyms:
EGFR EGFR_HUMAN ERBB1 | HER1
Type:
Enzyme Catalytic Domain
Mol. Mass.:
111216.35
Organism:
Homo sapiens (Human)
Description:
P00533[1-999,L858R]
Residue:
999
  
Inhibitor
Name:
BDBM31340
Synonyms:
2-methoxy-N-[(E)-3-[4-[3-methyl-4-(6-methylpyridin-3-yl)oxyanilino]quinazolin-6-yl]prop-2-enyl]acetamide 2-methoxy-N-[(E)-3-[4-[3-methyl-4-[(6-methyl-3-pyridyl)oxy]anilino]quinazolin-6-yl]allyl]acetamide CHEMBL483321 cid_9874913
Type:
Small organic molecule
Emp. Form.:
C27H27N5O3
Mol. Mass.:
469.535
SMILES:
COCC(=O)NC\C=C\c1ccc2ncnc(Nc3ccc(Oc4ccc(C)nc4)c(C)c3)c2c1
: