Target
Dimer of Gag-Pol polyprotein [489-587]
Ligand
BDBM1231
Substrate
decapeptide substrate
Meas. Tech.
Protease Inhibition Assay
pH
5.5±n/a
Temperature
310.15±n/a K
IC50
3.0±n/a nM
Citation
 Beaulieu, PLWernic, DAbraham, AAnderson, PCBogri, TBousquet, YCroteau, GGuse, ILamarre, DLiard, FParis, WThibeault, DPav, STong, L Potent HIV protease inhibitors containing a novel (hydroxyethyl)amide isostere. J Med Chem 40:2164-76 (1997)  
Target
Name:
Dimer of Gag-Pol polyprotein [489-587]
Synonyms:
HIV-1 Protease
Type:
Protein Complex
Mol. Mass.:
Description:
Components:
This complex has 2 components.
Component 1
Name:
Gag-Pol polyprotein [489-587]
Synonyms:
HIV protease HIV-1 Protease chain A POL_HV1N5 | gag-pol
Type:
Enzyme Subunit
Mol. Mass.:
10822.21
Organism:
Human immunodeficiency virus type 1
Description:
P12497[489-587]
Residue:
99
  
Component 2
Name:
Gag-Pol polyprotein [489-587]
Synonyms:
HIV protease HIV-1 Protease chain A POL_HV1N5 | gag-pol
Type:
Enzyme Subunit
Mol. Mass.:
10822.21
Organism:
Human immunodeficiency virus type 1
Description:
P12497[489-587]
Residue:
99
  
Inhibitor
Name:
BDBM1231
Synonyms:
(Hydroxyethyl)amidosuccinoyl deriv. 3 | benzyl N-[(1S)-1-{[(2S,3R)-4-[(2R)-N,2-di-tert-butylbutanediamido]-3-hydroxy-1-phenylbutan-2-yl]carbamoyl}-2-methylpropyl]carbamate
Type:
Small organic molecule
Emp. Form.:
C35H52N4O6
Mol. Mass.:
624.8106
SMILES:
CC(C)[C@H](NC(=O)OCc1ccccc1)C(=O)N[C@@H](Cc1ccccc1)[C@H](O)CNC(=O)[C@H](CC(=O)NC(C)(C)C)C(C)(C)C
:
Substrate
Name:
decapeptide substrate
Synonyms:
Type:
Peptide
Mol. Mass.:
1417.08
Organism:
Description:
Residue:
12
VSFNFPQITLNH