Target
Non-receptor tyrosine-protein kinase TNK1
Ligand
BDBM6866
Substrate
Meas. Tech.
Kinase Inhibitor Selectivity Profiling Assay
Kd
980±n/a nM
Citation
 PubChem, PC Kinase Inhibitor Selectivity Profiling Assay PubChem Bioassay (2008)[AID] 
Target
Name:
Non-receptor tyrosine-protein kinase TNK1
Synonyms:
Non-receptor tyrosine-protein kinase TNK1 TNK1_HUMAN
Type:
PROTEIN
Mol. Mass.:
72495.61
Organism:
Homo sapiens (Human)
Description:
ChEMBL_774410
Residue:
666
  
Inhibitor
Name:
BDBM6866
Synonyms:
1-Acyl-1H-[1,2,4]triazole-3,5-diamine Analogue 3b 4-[[5-Amino-1-(2,6-difluorobenzoyl)-1H-1,2,4-triazol-3-yl]amino]-benzenesulfonamide JNJ-7706621 | cid_5330790
Type:
Small organic molecule
Emp. Form.:
C15H12F2N6O3S
Mol. Mass.:
394.356
SMILES:
Nc1nc(Nc2ccc(cc2)S(N)(=O)=O)nn1C(=O)c1c(F)cccc1F
: