Target
Non-receptor tyrosine-protein kinase TNK1
Ligand
BDBM4814
Substrate
Meas. Tech.
Kinase Inhibitor Selectivity Profiling Assay
Kd
680±n/a nM
Citation
 PubChem, PC Kinase Inhibitor Selectivity Profiling Assay PubChem Bioassay (2008)[AID] 
Target
Name:
Non-receptor tyrosine-protein kinase TNK1
Synonyms:
Non-receptor tyrosine-protein kinase TNK1 TNK1_HUMAN
Type:
PROTEIN
Mol. Mass.:
72495.61
Organism:
Homo sapiens (Human)
Description:
ChEMBL_774410
Residue:
666
  
Inhibitor
Name:
BDBM4814
Synonyms:
CHEMBL535 N-[2-(diethylamino)ethyl]-5-{[(3Z)-5-fluoro-2-oxo-2,3-dihydro-1H-indol-3-ylidene]methyl}-2,4-dimethyl-1H-pyrrole-3-carboxamide SUNITINIB US10464902, Sunitinib US9163010, Sunitinib | US9914707, SU11248
Type:
Small organic molecule
Emp. Form.:
C22H27FN4O2
Mol. Mass.:
398.4738
SMILES:
CCN(CC)CCNC(=O)c1c(C)[nH]c(\C=C2/C(=O)Nc3ccc(F)cc23)c1C
: