Target
Receptor tyrosine-protein kinase erbB-4
Ligand
BDBM31090
Substrate
Meas. Tech.
Kinase Inhibitor Selectivity Profiling Assay
Kd
21±n/a nM
Citation
 PubChem, PC Kinase Inhibitor Selectivity Profiling Assay PubChem Bioassay (2008)[AID] 
Target
Name:
Receptor tyrosine-protein kinase erbB-4
Synonyms:
ERBB4 Epidermal growth factor receptor ErbB-4 (HER4) Tyrosine Kinase Proto-oncogene c-ErbB-4 Receptor protein-tyrosine kinase erbB-4 Tyrosine kinase-type cell surface receptor HER4 (HER4)
Type:
Protein
Mol. Mass.:
146803.56
Organism:
Homo sapiens (Human)
Description:
Q15303
Residue:
1308
  
Inhibitor
Name:
BDBM31090
Synonyms:
(E)-N-[4-(3-chloro-4-fluoro-anilino)-3-cyano-7-ethoxy-6-quinolyl]-4-(dimethylamino)but-2-enamide (E)-N-[4-(3-chloro-4-fluoroanilino)-3-cyano-7-ethoxyquinolin-6-yl]-4-(dimethylamino)but-2-enamide EKB-569 cid_6445562
Type:
Small organic molecule
Emp. Form.:
C24H23ClFN5O2
Mol. Mass.:
467.923
SMILES:
CCOc1cc2ncc(C#N)c(Nc3ccc(F)c(Cl)c3)c2cc1NC(=O)\C=C\CN(C)C
: