Target
Interleukin-1 receptor-associated kinase 3
Ligand
BDBM31093
Substrate
Meas. Tech.
Kinase Inhibitor Selectivity Profiling Assay
Kd
1400000±n/a nM
Citation
 PubChem, PC Kinase Inhibitor Selectivity Profiling Assay PubChem Bioassay (2008)[AID] 
Target
Name:
Interleukin-1 receptor-associated kinase 3
Synonyms:
IL-1 receptor-associated kinase M IRAK-M IRAK3_HUMAN
Type:
PROTEIN
Mol. Mass.:
67767.98
Organism:
Homo sapiens (Human)
Description:
EBI_101055
Residue:
596
  
Inhibitor
Name:
BDBM31093
Synonyms:
4-[[7-[2,6-bis(fluoranyl)phenyl]-9-chloranyl-5H-pyrimido[5,4-d][2]benzazepin-2-yl]amino]benzoic acid BDBM31832 MLN-8054 | cid_11712649
Type:
Small organic molecule
Emp. Form.:
C25H15ClF2N4O2
Mol. Mass.:
476.862
SMILES:
OC(=O)c1ccc(Nc2ncc3CN=C(c4cc(Cl)ccc4-c3n2)c2c(F)cccc2F)cc1
: