Target
fMet-Leu-Phe receptor
Ligand
BDBM37781
Substrate
Meas. Tech.
Dose Response Assay for Formylpeptide Receptor (FPR) Ligands and Dose Response Counter-Screen Assay for Formylpeptide-Like-1 (FPRL1) Ligands
Ki
6400±n/a nM
Citation
 PubChem, PC Dose Response Assay for Formylpeptide Receptor (FPR) Ligands and Dose Response Counter-Screen Assay for Formylpeptide-Like-1 (FPRL1) Ligands PubChem Bioassay (2007)[AID] 
Target
Name:
fMet-Leu-Phe receptor
Synonyms:
FPR FPR1_HUMAN N-formyl peptide receptor 1 fMLP receptor formyl peptide receptor 1
Type:
Enzyme Catalytic Domain
Mol. Mass.:
38456.14
Organism:
Homo sapiens (Human)
Description:
gi_4503779
Residue:
350
  
Inhibitor
Name:
BDBM37781
Synonyms:
2-(4-ethoxyphenyl)-3-(furan-2-carbonyl)-4-hydroxy-1-(3-imidazol-1-ylpropyl)-2H-pyrrol-5-one 2-(4-ethoxyphenyl)-3-[2-furanyl(oxo)methyl]-4-hydroxy-1-[3-(1-imidazolyl)propyl]-2H-pyrrol-5-one 5-(4-ethoxyphenyl)-4-(2-furoyl)-3-hydroxy-1-[3-(1H-imidazol-1-yl)propyl]-1,5-dihydro-2H-pyrrol-2-one SMR000071427 | cid_2918378
Type:
Small organic molecule
Emp. Form.:
C23H23N3O5
Mol. Mass.:
421.4458
SMILES:
CCOc1ccc(cc1)C1C(C(=O)c2ccco2)C(=O)C(=O)N1CCCn1ccnc1
: