Target
N-formyl peptide receptor 2
Ligand
BDBM37643
Substrate
Meas. Tech.
Dose Response Assay for Formylpeptide Receptor-Like-1 (FPRL1) Ligands and Dose Response Counter-Screen Assay for Formylpeptide Receptor (FPR) Ligands
Ki
>40300±n/a nM
Comments
Extracted from aid = 520 and tid = 2
Citation
 PubChem, PC Dose Response Assay for Formylpeptide Receptor-Like-1 (FPRL1) Ligands and Dose Response Counter-Screen Assay for Formylpeptide Receptor (FPR) Ligands PubChem Bioassay (2007)[AID] 
Target
Name:
N-formyl peptide receptor 2
Synonyms:
ALXR, FPRL1, FPR2 FPR2 FPRH1 Formyl Peptide Receptor-Like 1 LXA4 receptor Lipoxin A4 receptor RFP | hFPRL
Type:
G Protein-Coupled Receptor (GPCR)
Mol. Mass.:
38968.35
Organism:
Homo sapiens (Human)
Description:
P25090
Residue:
351
  
Inhibitor
Name:
BDBM37643
Synonyms:
(4Z)-5-(2,5-dimethoxyphenyl)-1-(2-furanylmethyl)-4-[hydroxy(phenyl)methylidene]pyrrolidine-2,3-dione (4Z)-5-(2,5-dimethoxyphenyl)-1-(furan-2-ylmethyl)-4-[hydroxy(phenyl)methylidene]pyrrolidine-2,3-dione MLS000036525 cid_5389251
Type:
Small organic molecule
Emp. Form.:
C24H21NO6
Mol. Mass.:
419.4266
SMILES:
COc1ccc(OC)c(c1)C1C(C(=O)c2ccccc2)C(=O)C(=O)N1Cc1ccco1
: