Target
Mevalonate kinase
Ligand
BDBM38606
Substrate
Meas. Tech.
Screening for Inhibitors of the Mevalonate Pathway in Streptococcus Pneumoniae - MK Dose Response
IC50
25018.3±n/a nM
Citation
 PubChem, PC Screening for Inhibitors of the Mevalonate Pathway in Streptococcus Pneumoniae - MK Dose Response PubChem Bioassay (2007)[AID] 
Target
Name:
Mevalonate kinase
Synonyms:
Type:
Enzyme Catalytic Domain
Mol. Mass.:
31420.64
Organism:
Streptococcus pneumoniae D39
Description:
A0A0H2ZQX9
Residue:
292
  
Inhibitor
Name:
BDBM38606
Synonyms:
7-(3,5-dimethoxyanilino)-6-(2-furanylmethyl)-7H-pyrrolo[3,4-b]pyridin-5-one 7-(3,5-dimethoxyanilino)-6-(furan-2-ylmethyl)-7H-pyrrolo[3,4-b]pyridin-5-one 7-[(3,5-dimethoxyphenyl)amino]-6-(furan-2-ylmethyl)-7H-pyrrolo[3,4-b]pyridin-5-one SMR000028156 | cid_3241207
Type:
Small organic molecule
Emp. Form.:
C20H19N3O4
Mol. Mass.:
365.3826
SMILES:
COc1cc(Nc2n(Cc3ccco3)c(=O)c3ccc[nH]c23)cc(OC)c1
: