Target
Mevalonate kinase
Ligand
BDBM50244216
Substrate
Meas. Tech.
Screening for Inhibitors of the Mevalonate Pathway in Streptococcus Pneumoniae - MK Dose Response
IC50
3289±n/a nM
Citation
 PubChem, PC Screening for Inhibitors of the Mevalonate Pathway in Streptococcus Pneumoniae - MK Dose Response PubChem Bioassay (2007)[AID] 
Target
Name:
Mevalonate kinase
Synonyms:
Type:
Enzyme Catalytic Domain
Mol. Mass.:
31420.64
Organism:
Streptococcus pneumoniae D39
Description:
A0A0H2ZQX9
Residue:
292
  
Inhibitor
Name:
BDBM50244216
Synonyms:
2,3-dihydropyrrolo[2,1-b]quinazolin-9(1H)-one cid_68261
Type:
Small organic molecule
Emp. Form.:
C11H10N2O
Mol. Mass.:
186.2099
SMILES:
O=c1n2CCCc2nc2ccccc12
: