Target
Steroidogenic factor 1
Ligand
BDBM38909
Substrate
Meas. Tech.
Dose-response cell-based assay for inhibitors of the nuclear receptor Steroidogenic Factor 1 (SF-1)
IC50
>11000±n/a nM
Citation
 PubChem, PC Dose-response cell-based assay for inhibitors of the nuclear receptor Steroidogenic Factor 1 (SF-1) PubChem Bioassay (2007)[AID] 
Target
Name:
Steroidogenic factor 1
Synonyms:
AD4BP FTZF1 NR5A1 SF-1 STF-1 Steroid hormone receptor Ad4BP
Type:
Nuclear Hormone Receptor
Mol. Mass.:
51643.43
Organism:
Homo sapiens (Human)
Description:
Residue:
461
  
Inhibitor
Name:
BDBM38909
Synonyms:
7-[(E)-3-chloranylbut-2-enyl]-1,3-dimethyl-8-(2-phenylethylamino)purine-2,6-dione 7-[(E)-3-chlorobut-2-enyl]-1,3-dimethyl-8-(phenethylamino)xanthine SMR000044779 | cid_5389756
Type:
Small organic molecule
Emp. Form.:
C19H22ClN5O2
Mol. Mass.:
387.863
SMILES:
C\C(Cl)=C/Cn1c(NCCc2ccccc2)nc2n(C)c(=O)n(C)c(=O)c12
: