Target
Steroidogenic factor 1
Ligand
BDBM38924
Substrate
Meas. Tech.
Counterscreen for inhibitors of the Retinoic Acid Receptor-related orphan receptor A (RORA): A cell-based dose-response assay for inhibition of the Steroidogenic Factor 1 (SF-1)
IC50
2815±n/a nM
Citation
 PubChem, PC Counterscreen for inhibitors of the Retinoic Acid Receptor-related orphan receptor A (RORA): A cell-based dose-response assay for inhibition of the Steroidogenic Factor 1 (SF-1) PubChem Bioassay (2007)[AID] 
Target
Name:
Steroidogenic factor 1
Synonyms:
AD4BP FTZF1 NR5A1 SF-1 STF-1 Steroid hormone receptor Ad4BP
Type:
Nuclear Hormone Receptor
Mol. Mass.:
51643.43
Organism:
Homo sapiens (Human)
Description:
Residue:
461
  
Inhibitor
Name:
BDBM38924
Synonyms:
2,6-bis(2-pyridinyl)pyridine 2,6-dipyridin-2-ylpyridine SMR000060049 | cid_70848
Type:
Small organic molecule
Emp. Form.:
C15H11N3
Mol. Mass.:
233.2679
SMILES:
c1ccc(nc1)-c1cccc(n1)-c1ccccn1
: