Target
M-phase inducer phosphatase 2
Ligand
BDBM31042
Substrate
Meas. Tech.
Cdc25B Catalytic Domain Protein Tyrosine Phosphatase Probe Assessment Dose Response assay in 25 mM DTT and Catalase.
IC50
>50000±n/a nM
Citation
 PubChem, PC Cdc25B Catalytic Domain Protein Tyrosine Phosphatase Probe Assessment Dose Response assay in 25 mM DTT and Catalase. PubChem Bioassay (2007)[AID] 
Target
Name:
M-phase inducer phosphatase 2
Synonyms:
CDC25B Dual specificity phosphatase (CDC25B) M-phase inducer phosphatase 2 (CDC25B) | MPIP2_HUMAN
Type:
Protein
Mol. Mass.:
64985.27
Organism:
Homo sapiens (Human)
Description:
Residue:
580
  
Inhibitor
Name:
BDBM31042
Synonyms:
(5-acetamido-4-acetyloxy-2,1,3-benzoxadiazol-7-yl) acetate Acetic acid 7-acetoxy-5-acetylamino-benzo[1,2,5]oxadiazol-4-yl ester SMR000008576 acetic acid (6-acetamido-7-acetoxy-benzofurazan-4-yl) ester | cid_597363
Type:
Small organic molecule
Emp. Form.:
C12H11N3O6
Mol. Mass.:
293.2322
SMILES:
CC(=O)Nc1cc(OC(C)=O)c2nonc2c1OC(C)=O
: